{"text_format":"1","workbook":"xlsx","n_sheets":10,"sheets":["Instructions (LHUK)","Parts 1 and 2","Part 3 REACh","Part 3 SVHCs","Part 4 RoHS","Part 5 Radioactive Sources","Attribute Lookup","Export Lookup","Parameter Lookup","Import Options"],"not_rendered":{"charts":0,"images":1,"macros":1,"external_links":0,"defined_names":56,"comments":2,"pivot_tables":0},"unopened":[],"bounds":{"document_bytes":16777216,"sheet_cells":100000,"rows_first":2000,"rows_last":500,"rows_between":2000,"halvings":0,"cell_chars":16384,"cell_head_chars":4096},"cells_cut":0,"cells_raw":0,"read":"whole","date_system":"1900"}

{"sheet":"Instructions (LHUK)","index":0,"n_rows":87,"n_cols":11,"rows_kept":87,"cut":false,"hidden":false,"merged":[[9,1,10,5],[12,1,13,5],[15,1,16,5]]}
["Restricted Substance and Radioactive Source Declaration In Articles supplied to LHUK"]
[]
["This template requires you to \"declare\", or provide information about, the presence of certain substances and radioactive sources in articles "]
["(parts/products etc) supplied to LHUK."]
[]
["The articles (part numbers or product identifications etc) and the substances/sources should be listed in the declaration Parts 3, 4 and 5."]
[]
["Please complete the template, even if there are no substances in any articles supplied and return it electronically as an excel file within 60 days to the following person:"]
[]
["Name:","LHUK Procurement"]
[]
[]
["Email:","reach.mbx@agustawestland.com"]
[]
[]
["Telephone","+44(0) 1935 703773"]
[]
[]
[]
["Any questions regarding the completion of the declaration should be addresssed to the above person."]
[]
["The process for completion is:"]
[]
[]
[null,null,null,"Indicates that the field will be pre-completed by LH UK.",null,null,null,null,null,null,"Indicates that the field must be completed by the supplier."]
[]
[]
[]
[]
[]
[]
[]
[]
[]
[]
[]
[]
[]
[]
[]
{"$rows_left_out":48}
{"sheet":"Parts 1 and 2","index":1,"n_rows":26,"n_cols":3,"rows_kept":26,"cut":false,"hidden":false,"merged":[[5,0,5,7],[1,0,1,1],[2,0,2,7],[3,0,3,7],[4,0,4,1],[4,2,4,7],[1,2,1,7],[6,0,6,1],[6,2,6,7],[7,0,7,1],[7,2,7,7],[8,0,8,1],[8,2,8,7],[9,0,9,1],[9,2,9,7],[10,0,10,1],[10,2,10,7],[11,0,11,1],[11,2,11,7],[12,0,12,1],[12,2,12,7],[13,0,13,7],[14,0,14,7],[15,0,15,1],[15,2,15,7],[23,0,23,7],[16,0,16,1],[16,2,16,7],[17,0,17,1],[17,2,17,7],[18,0,18,1],[18,2,18,7],[19,0,19,1],[19,2,19,7],[20,0,20,7],[21,0,21,7],[22,0,22,7]]}
[]
[]
["WA4299-6 Hazardous Substances Identification"]
["MATERIAL DECLARATION FORM"]
["LHUK Buyer e-mail"]
["PART 1: Supplier Details"]
["Company Name"]
["Supplier Address"]
["Supplier Identification Code"]
["Supplier's Contact: name, e-mail and telephone"]
["Supplier HSE: name, e-mail and telephone"]
["Environmental Management System "]
["Environmental certification "]
["PART 2: Supplier Declaration"]
["The Supplier shall declare whether any articles concerned by the legisation listed below are delivered to LHUK. Should the Supplier state \"Applicable\" for any regulation below, the Supplier shall complete the appropriate part of the Material Declaration Form for each article concerned by that legislation."]
["REACH ECHA SVHC Candidate List\n(PART 3)",null,"\n\n\n        Supplier REACH Responsible:"]
["RoHS Leadfree soldering (Electronic Articles only)\n(PART 4)",null,"\n\n\n        Supplier RoHS Responsible:"]
["RoHS Restricted Substances (Electronic Articles only)\n(PART 4)",null,"Supplier: RoHS Responsible"]
["Radioactive Source\n(Part 5)",null,"\n\n\n        Supplier Radio-emissive Responsible: "]
[null,null,"I guarantee the accuracy and the reliability of the information provided herein at the time of signature of such MDF,\nand I guarantee that the information sent in MDF by post mail is identical to the one that may be provided electronically"]
["Date:  "]
["Supplier Signature: "]
["Name: "]
["Title: "]
[]
[null,"COTS","Commercial off the Shelf (Products)"]

{"sheet":"Part 3 REACh","index":2,"n_rows":40,"n_cols":12,"rows_kept":40,"cut":false,"hidden":false,"merged":[[0,1,0,6],[16,11,20,11],[1,1,1,6],[10,5,10,6],[8,1,8,3],[2,1,2,6],[7,1,7,3],[9,1,9,3],[7,4,7,6],[8,5,8,6],[15,2,15,6],[11,5,11,6],[12,5,12,6],[11,2,11,3],[12,2,12,3],[13,2,13,3],[14,5,14,6],[5,1,5,2],[13,5,13,6],[10,2,10,3],[3,1,3,6],[4,1,4,6],[5,3,5,6],[9,5,9,6]]}
[]
[null,"Part 3: Article Declaration Form - Complete One Sheet per Article/Part Number"]
[null,"All substances with a partial weight of > 0.1% of the item and substances intended for release have to be declared in the list below.\n\nThe content of the drop down boxes is derieved from the 'SVHC' worksheet. The list will be generated from the ECHA Candidate List. \n\nChoosing the content of one drop down box will automatically synchronise the other drop down boxes. Text box 4 must be filled in for each substance. Text box 6 may be filled in if this information is available). Add the chemical by clicking the Add Chemical button. When you have finished, click on the Validate Declaration Form button to check for errors."]
[null,"       I guarantee that all Article(s) containing any substance as identified hereabove, according to available information, is clearly identified"]
[null,"       I guarantee the absence of substances intended to be released by the Article, as per REACh, according to available information"]
[null,"There is a Substitution Plan"]
[null,null,null,null,null,null,null,"lb",1,"Incorporated"]
[null,"Article Name",null,null,"Supplier Information",null,null,"kg",2,"Used in production"]
[null,null,null,null,"Supplier Name",null,null,null,3,"Used in the coating"]
[null,"Requester Information",null,null,"Supplier Part #",null,null,null,4]
[null,"Company Name","LHUK",null,"Supplier Part Desc"]
[null,"AW SAP #",null,null,"Prepared by"]
[null,"AW Part Desc",null,null,"Date of declaration"]
[null,"Declaration #","WA4299-6",null,"Weight of Item, as delivered."]
[null,null,null,null,"Unit (lbs / kg)","kg"]
[]
["Row#","1. CAS Number","2. EC (EINECS or ELINCS) Number ","3. Substance Name","4. Weight Percent","5. Registration Number\n (if available)\nTo be filled in by supplier","6. Category",null,null,null,null,"Double click to delete row"]
[null,{"$f":"INDEX('Part 3 SVHCs'!B2:B305,'Part 3 REACh'!$A$19,1)","v":"2580-56-5"},{"$f":"INDEX('Part 3 SVHCs'!C2:C305,'Part 3 REACh'!$A$19,1)","v":"219-943-6"},{"$f":"INDEX('Part 3 SVHCs'!D2:D305,'Part 3 REACh'!A19,1)","v":"[4-[[4-anilino-1-naphthyl][4-(dimethylamino)phenyl]methylene]cyclohexa-2,5-dien-1-ylidene] dimethylammonium chloride (C.I. Basic Blue 26) [with ≥ 0.1% of Michler's ketone (EC No. 202-027-5) or Michler's base (EC No. 202-959-2)]\n"},0,null,"Incorporated"]
[1]
[null,null,null,null,"Total"]
[0,null,null,null,{"$f":"SUM(E22:E39)","v":0}]
[{"$f":"IF(B22=\"\",\"\",#REF!+1)","v":""}]
[{"$f":"IF(B23=\"\",\"\",A22+1)","v":""}]
[""]
[""]
[""]
[""]
[""]
[""]
[""]
[""]
[""]
[]
[]
[{"$f":"IF(B35=\"\",\"\",A32+1)","v":""}]
[{"$f":"IF(B36=\"\",\"\",#REF!+1)","v":""}]
[{"$f":"IF(B37=\"\",\"\",A36+1)","v":""}]
[{"$f":"IF(B38=\"\",\"\",A37+1)","v":""}]
[{"$f":"IF(B39=\"\",\"\",A38+1)","v":""}]
[null,null,null,null,null,null,null,234]
{"$rows_left_out":1}
{"sheet":"Part 3 SVHCs","index":3,"n_rows":227,"n_cols":4,"rows_kept":227,"cut":false,"hidden":false,"merged":[]}
["Record Name","1. CAS Number","2. EC Number","3. Substance Name"]
["1,2,3-Trichloropropane [96-18-4]","2580-56-5","219-943-6","[4-[[4-anilino-1-naphthyl][4-(dimethylamino)phenyl]methylene]cyclohexa-2,5-dien-1-ylidene] dimethylammonium chloride (C.I. Basic Blue 26) [with ≥ 0.1% of Michler's ketone (EC No. 202-027-5) or Michler's base (EC No. 202-959-2)]\n"]
["1,2-Benzenedicarboxylic acid, di-C6-8-branched alkyl esters, C7-rich [71888-89-6]","548-62-9","208-953-6","[4-[4,4'-bis(dimethylamino) benzhydrylidene]cyclohexa-2,5-dien-1-ylidene]dimethylammonium chloride (C.I. Basic Violet 3) [with ≥ 0.1% of Michler's ketone (EC No. 202-027-5) or Michler's base (EC No. 202-959-2)]\n"]
[null,"69011-06-9","273-688-5","[Phthalato(2-)]dioxotrilead"]
["1,2-benzenedicarboxylic acid; di-C7-11-branched a [68515-42-4]","96-18-4","202-486-1","1,2,3-Trichloropropane"]
["2,4-Dinitrotoluene [121-14-2]","68515-51-5","68515-51-5\n","1,2-benzenedicarboxylic acid, di-C6-10-alkyl esters; 1,2-benzenedicarboxylic acid, mixed decyl and hexyl and octyl diesters with ≥ 0.3% of dihexyl phthalate (EC No. 201-559-5)"]
[null,"68648-93-1","68648-93-1","1,2-benzenedicarboxylic acid, di-C6-10-alkyl esters; 1,2-benzenedicarboxylic acid, mixed decyl and hexyl and octyl diesters with ≥ 0.3% of dihexyl phthalate (EC No. 201-559-5)"]
["2-Ethoxyethanol [110-80-5]","71888-89-6","276-158-1","1,2-Benzenedicarboxylic acid, di-C6-8-branched alkyl esters, C7-rich"]
["2-ethoxyethyl acetate; ethylglycol acetate [111-15-9]","68515-50-4","271-093-5","1,2-Benzenedicarboxylic acid, dihexyl ester, branched and linear"]
["2-Methoxyethanol [109-86-4]","84777-06-0","284-032-2","1,2-Benzenedicarboxylic acid, dipentylester, branched and linear"]
[null,"68515-42-4","271-084-6","1,2-Benzenedicarboxylic acid; di-C7-11-branched and linear alkyl esters"]
["4,4'- Diaminodiphenylmethane [101-77-9]","112-49-2","203-977-3","1,2-bis(2-methoxyethoxy)ethane (TEGDME; triglyme)"]
["5-tert-butyl-2,4,6-trinitro-m-xylene (musk xylene) [81-15-2]","107-06-2","203-458-1","1,2-Dichloroethane"]
["Acrylamide [79-06-1]","629-14-1","211-076-1","1,2-diethoxyethane"]
[null,"110-71-4","203-794-9","1,2-dimethoxyethane; ethylene glycol dimethyl ether (EGDME)"]
["Alkanes, C10-13, chloro;  (Short chain chlorinated paraffins ) [85535-84-8]","2451-62-9","219-514-3","1,3,5-tris(oxiranylmethyl)-1,3,5-triazine-2,4,6(1H,3H,5H)-trione (TGIC)"]
["alpha-hexabromocyclododecane [134237-50-6]","59653-74-6","423-400-0","1,3,5-tris[(2S and 2R)-2,3-epoxypropyl]-1,3,5-triazine-2,4,6-(1H,3H,5H)-trione (β-TGIC)"]
["Aluminosilicate, Refractory Ceramic Fibres [NOCAS0080]","1120-71-4","1120-71-4","1,3-propanesultone"]
["Ammonium bichromate [7789-09-5]","-","-","1,6,7,8,9,14,15,16,17,17,18,18-Dodecachloropentacyclo[12.2.1.16,9.02,13.05,10]octadeca-7,15-diene (“Dechlorane Plus”TM) [covering any of its individual anti- and syn-isomers or any combinationthereof]"]
["Anthracene [120-12-7]","15087-24-8","15087-24-8","1,7,7-trimethyl-3-(phenylmethylene)bicyclo[2.2.1]heptan-2-one "]
["Anthracene oil [90640-80-5]","106-94-5","203-445-0","1-bromopropane (n-propyl bromide)"]
["Anthracene oil, anthracene paste [90640-81-6]","872-50-4","212-828-1","1-Methyl-2-pyrrolidone"]
[null,"36437-37-3","36437-37-3","2-(2H-benzotriazol-2-yl)-4-(tert-butyl)-6-(sec-butyl)phenol (UV-350)"]
["Anthracene oil, anthracene paste, anthracene fraction [91995-15-2]","25973-55-1","25973-55-1","2-(2H-benzotriazol-2-yl)-4,6-ditertpentylphenol (UV-328)"]
[null,"6807-17-6","6807-17-6","2,2-bis(4'-hydroxyphenyl)-4-methylpentane"]
["Anthracene oil, anthracene-low; Anthracene Oil Fr [90640-82-7]","101-14-4","202-918-9","2,2'-dichloro-4,4'-methylenedianiline (MOCA)"]
["Arsenic trioxide [1327-53-3]","-","-","2,3,3,3-tetrafluoro-2-(heptafluoropropoxy)propionic acid, its salts and its acyl halides (covering any of their individual isomers and combinations thereof)"]
["Benzyl butyl phthalate [85-68-7]","121-14-2","204-450-0","2,4-Dinitrotoluene"]
[null,"3864-99-1","3864-99-1","2,4-di-tert-butyl-6-(5-chlorobenzotriazol-2-yl)phenol (UV-327)"]
[null,"3846-71-7","3846-71-7","2-benzotriazol-2-yl-4,6-di-tert-butylphenol (UV-320)"]
[null,"110-80-5","203-804-1","2-Ethoxyethanol"]
[null,"111-15-9","203-839-2","2-Ethoxyethyl acetate; ethylglycol acetate"]
[null,"15571-58-1","15571-58-1","2-ethylhexyl 10-ethyl-4,4-dioctyl-7-oxo-8-oxa-3,5-dithia-4-stannatetradecanoate (DOTE)"]
[null,"90-04-0","201-963-1","2-Methoxyaniline o-Anisidine"]
["beta-hexabromocyclododecane [134237-51-7]","109-86-4","203-713-7","2-Methoxyethanol"]
[null,"110-49-6","110-49-6","2-methoxyethyl acetate"]
[null,"143860-04-2","421-150-7","3-ethyl-2-methyl-2-(3-methylbutyl)-1,3-oxazolidine"]
["Bis (2-ethyl(hexyl)phthalate) (DEHP) [117-81-7]","140-66-9","205-426-2","4-(1,1,3,3-tetramethylbutyl)phenol, (4-tert-Octylphenol)"]
["Bis(tributyltin) oxide [56-35-9]","-","-","4-(1,1,3,3-tetramethylbutyl)phenol, ethoxylated. [Covering well-defined substances and UVCB substances, polymers and homologues]"]
["Borax [1303-96-4]","101-77-9","202-974-4","4,4'- Diaminodiphenylmethane (MDA)"]
{"$rows_left_out":188}
{"sheet":"Part 4 RoHS","index":4,"n_rows":23,"n_cols":29,"rows_kept":23,"cut":false,"hidden":false,"merged":[[1,0,1,1],[3,2,3,3],[2,0,2,10],[17,7,17,8],[11,7,11,8],[12,7,12,8],[13,7,13,8],[14,7,14,8],[15,7,15,8],[16,7,16,8],[5,7,5,8],[6,7,6,8],[1,2,1,10],[19,0,19,3],[7,7,7,8],[8,7,8,8],[9,7,9,8],[10,7,10,8]]}
[]
[]
["PART 4: RoHS - Leadfree Soldering and/or Restricted Substances",null,null,null,null,null,null,null,null,null,null,null,null,null,null,null,null,null,null,null,null,null,null,null,null,null,null,null,"Commercial"]
[null,"Supplier Name:",null,null,null,null,null,null,null,null,null,null,null,null,null,null,null,null,null,null,null,null,null,null,null,null,null,null,"Military"]
["In case of positive answer, please fill-in the table below (One line per Article/Part Number)"]
[null,"Supplier Part Number","Supplier Part Desc","AW SAP Part Number","AW Part Description","CAS Number","EC Number","Chemical Name",null,"Weight %","AW Category"]
[1]
[2]
[3]
[4]
[5]
[6]
[7]
[8]
[9]
[10]
[11]
["…","etc…"]
[]
["Note: In case additional information is required, the Supplier will be contacted directly by LHUK."]
[]
["For further information:"]
["http://rohs.eu/"]

{"sheet":"Part 5 Radioactive Sources","index":5,"n_rows":21,"n_cols":7,"rows_kept":21,"cut":false,"hidden":false,"merged":[[0,0,0,2],[1,0,1,6],[3,0,3,2],[17,0,17,3],[2,2,2,3],[0,3,0,6]]}
[]
["Part 5: Products Containing Radioactive Sources"]
[null,"Supplier Name:"]
["In case of positive answer, please fill-in the table below (One line per Article/Part Number)"]
[]
["Supplier Part Number","Supplier Part Desc","AW SAP Part Number","AW Part Description","Part Commercial Name","Type of radionucleide contained in the item","activity (Bq)"]
[]
[]
[]
[]
[]
[]
[]
[]
[]
[]
[]
["Note: In case additional information is required, the Supplier will be contacted directly by LHUK."]
[]
["For further information:"]
["www.euratom.org"]

{"sheet":"Attribute Lookup","index":6,"n_rows":16,"n_cols":27,"rows_kept":16,"cut":false,"hidden":true,"merged":[]}
["Attribute Name","DataType","Units","Parent Attribute","Worksheet","Specimen","Data Range","Parameter 1 Range","Parameter 2 Range","Parameter 3 Range","Parameter 4 Range","Parameter 5 Range","Parameter 5 Name","Parameter 6 Range","Parameter 6 Name","Parameter 7 Range","Parameter 7 Name","Parameter 8 Range","Parameter 8 Name","Parameter 9 Range","Parameter 9 Name","Parameter 10 Range","Parameter 10 Name","Line Type","Log","Estimate","Interpolate"]
["Record Name","RCN",null,null,"Disclosure",null,"MI_RECORDNAME"]
["Total weight %","PNT","%",null,"Disclosure",null,"MI_TOTAL_WTPCT"]
["Supplier name","STXT",null,null,"Disclosure",null,"MI_COMPANY"]
["Request Date","DAT",null,null,"Disclosure",null,"MI_REQU_DAT"]
["Requester item number","STXT",null,null,"Disclosure",null,"MI_REQU_ITEM_NO"]
["Declaration number","STXT",null,null,"Disclosure",null,"MI_DEC_NO"]
["Supplier item number","STXT",null,null,"Disclosure",null,"MI_ITEM_NO"]
["Supplier item name","STXT",null,null,"Disclosure",null,"MI_ITEM_NAME"]
["Declaration prepared by","STXT",null,null,"Disclosure",null,"MI_PREPARER"]
["Date of declaration","DAT",null,null,"Disclosure",null,"MI_DECL_DAT"]
["Weight of item","PNT",{"$f":"'Part 3 REACh'!F15","v":"kg"},null,"Disclosure",null,"MI_WEIGHT"]
["Requester name","STXT",null,null,"Disclosure",null,"MI_REQUESTER_COMPANY"]
["Restricted substances associated with this article","TABL",null,null,"Disclosure",null,"MI_ROW_DATA","MI_CATEGORY","MI_WEIGHT_PC","MI_LINKED_VALUE"]
["Supplier declaration received?","LOG",null,null,"Import Options",null,"MI_DECL_RECEIVED"]
["Supplier declaration","FIL",null,null,"Import Options",null,"MI_DECL_FILE"]

{"sheet":"Export Lookup","index":7,"n_rows":5,"n_cols":31,"rows_kept":5,"cut":false,"hidden":true,"merged":[]}
["Attribute Name","DataType","Units","Parent Attribute","Worksheet","Specimen","Data Range","Parameter 1 Range","Parameter 1 Name","Parameter 2 Range","Parameter 2 Name","Parameter 3 Range","Parameter 3 Name","Parameter 4 Range","Parameter 4 Name","Parameter 5 Range","Parameter 5 Name","Parameter 6 Range","Parameter 6 Name","Parameter 7 Range","Parameter 7 Name","Parameter 8 Range","Parameter 8 Name","Parameter 9 Range","Parameter 9 Name","Parameter 10 Range","Parameter 10 Name","Line Type","Log","Estimate","Interpolate"]
["Record Name","RCN",null,null,"Detailed Chemicals List","Row","MI_RECORDNAME"]
["EC number","STXT",null,null,"Detailed Chemicals List","Row","MI_EC_NO"]
["CAS number","STXT",null,null,"Detailed Chemicals List","Row","MI_CAS"]
["Chemical name","STXT",null,null,"Detailed Chemicals List","Row","MI_CHEM_NAME"]

{"sheet":"Parameter Lookup","index":8,"n_rows":4,"n_cols":3,"rows_kept":4,"cut":false,"hidden":true,"merged":[]}
["Parameter","Data Range","Unit"]
["MI LINKED VALUE","MI_LINKED_VALUE"]
["Amount","MI_WEIGHT_PC","%"]
["Category","MI_CATEGORY"]

{"sheet":"Import Options","index":9,"n_rows":60,"n_cols":11,"rows_kept":60,"cut":false,"hidden":true,"merged":[[22,1,23,1]]}
[]
[null,"Auto-Placement",null,null,null,"Auto-Links","Link Cluster","Search Value","Search Attribute","Match Attribute","Match Property"]
[null,"DBKey",null,null,null,null,{"$f":"IF(H3=\"\",\"\",\"Restricted substances found in this article\")","v":"Restricted substances found in this article"},{"$f":"IF('Part 3 REACh'!B18=\"\",\"\",'Part 3 REACh'!B18)","v":"2580-56-5"},null,{"$f":"IF(H3=\"\",\"\",\"CAS number\")","v":"CAS number"}]
[null,"Table",null,null,null,null,{"$f":"IF(H4=\"\",\"\",\"Restricted substances found in this article\")","v":""},{"$f":"IF('Part 3 REACh'!B19=\"\",\"\",'Part 3 REACh'!B19)","v":""},null,{"$f":"IF(H4=\"\",\"\",\"CAS number\")","v":""}]
[null,"Search Value",null,null,null,null,"",{"$f":"IF('Part 3 REACh'!B20=\"\",\"\",'Part 3 REACh'!B20)","v":""},null,""]
[null,"Search Attribute",null,null,null,null,"",{"$f":"IF('Part 3 REACh'!B21=\"\",\"\",'Part 3 REACh'!B21)","v":""},null,""]
[null,"Match Property",null,null,null,null,"",{"$f":"IF('Part 3 REACh'!B22=\"\",\"\",'Part 3 REACh'!B22)","v":""},null,""]
[null,"Match Attribute",null,null,null,null,"",{"$f":"IF('Part 3 REACh'!B23=\"\",\"\",'Part 3 REACh'!B23)","v":""},null,""]
[null,"IsChildRecord",null,null,null,null,"",{"$f":"IF('Part 3 REACh'!B24=\"\",\"\",'Part 3 REACh'!B24)","v":""},null,""]
[null,"Filter",null,null,null,null,"",{"$f":"IF('Part 3 REACh'!B25=\"\",\"\",'Part 3 REACh'!B25)","v":""},null,""]
[null,null,null,null,null,null,"",{"$f":"IF('Part 3 REACh'!B26=\"\",\"\",'Part 3 REACh'!B26)","v":""},null,""]
[null,null,null,null,null,null,"",{"$f":"IF('Part 3 REACh'!B27=\"\",\"\",'Part 3 REACh'!B27)","v":""},null,""]
[null,"Additonal Information",null,null,null,null,"",{"$f":"IF('Part 3 REACh'!B28=\"\",\"\",'Part 3 REACh'!B28)","v":""},null,""]
[null,"Layout",null,null,null,null,"",{"$f":"IF('Part 3 REACh'!B29=\"\",\"\",'Part 3 REACh'!B29)","v":""},null,""]
[null,null,null,null,null,null,"",{"$f":"IF('Part 3 REACh'!B30=\"\",\"\",'Part 3 REACh'!B30)","v":""},null,""]
[null,null,null,null,null,null,"",{"$f":"IF('Part 3 REACh'!B31=\"\",\"\",'Part 3 REACh'!B31)","v":""},null,""]
[null,"Valid Table",null,null,null,null,"",{"$f":"IF('Part 3 REACh'!B32=\"\",\"\",'Part 3 REACh'!B32)","v":""},null,""]
[null,"Table 1","Bought-in Articles",null,null,null,"",{"$f":"IF('Part 3 REACh'!B33=\"\",\"\",'Part 3 REACh'!B33)","v":""},null,""]
[null,"Table 2","Restricted Substances",null,null,null,"",{"$f":"IF('Part 3 REACh'!B34=\"\",\"\",'Part 3 REACh'!B34)","v":""},null,""]
[null,"Table 3",null,null,null,null,"",{"$f":"IF('Part 3 REACh'!B35=\"\",\"\",'Part 3 REACh'!B35)","v":""},null,""]
[null,null,null,null,null,null,"",{"$f":"IF('Part 3 REACh'!B36=\"\",\"\",'Part 3 REACh'!B36)","v":""},null,""]
[null,null,null,null,null,null,"",{"$f":"IF('Part 3 REACh'!B37=\"\",\"\",'Part 3 REACh'!B37)","v":""},null,""]
[null,"Supplier declaration received?",true,null,null,null,"",{"$f":"IF('Part 3 REACh'!B38=\"\",\"\",'Part 3 REACh'!B38)","v":""},null,""]
[null,null,null,null,null,null,"",{"$f":"IF('Part 3 REACh'!B39=\"\",\"\",'Part 3 REACh'!B39)","v":""},null,""]
[null,"Declaration file","!FILENAME",null,null,null,"",{"$f":"IF('Part 3 REACh'!B40=\"\",\"\",'Part 3 REACh'!B40)","v":""},null,""]
[null,null,null,null,null,null,"",{"$f":"IF('Part 3 REACh'!B41=\"\",\"\",'Part 3 REACh'!B41)","v":""},null,""]
[null,null,null,null,null,null,"",{"$f":"IF('Part 3 REACh'!B42=\"\",\"\",'Part 3 REACh'!B42)","v":""},null,""]
[null,null,null,null,null,null,"",{"$f":"IF('Part 3 REACh'!B43=\"\",\"\",'Part 3 REACh'!B43)","v":""},null,""]
[null,null,null,null,null,null,"",{"$f":"IF('Part 3 REACh'!B44=\"\",\"\",'Part 3 REACh'!B44)","v":""},null,""]
[null,null,null,null,null,null,"",{"$f":"IF('Part 3 REACh'!B45=\"\",\"\",'Part 3 REACh'!B45)","v":""},null,""]
[null,null,null,null,null,null,"",{"$f":"IF('Part 3 REACh'!B46=\"\",\"\",'Part 3 REACh'!B46)","v":""},null,""]
[null,null,null,null,null,null,"",{"$f":"IF('Part 3 REACh'!B47=\"\",\"\",'Part 3 REACh'!B47)","v":""},null,""]
[null,null,null,null,null,null,"",{"$f":"IF('Part 3 REACh'!B48=\"\",\"\",'Part 3 REACh'!B48)","v":""},null,""]
[null,null,null,null,null,null,"",{"$f":"IF('Part 3 REACh'!B49=\"\",\"\",'Part 3 REACh'!B49)","v":""},null,""]
[null,null,null,null,null,null,"",{"$f":"IF('Part 3 REACh'!B50=\"\",\"\",'Part 3 REACh'!B50)","v":""},null,""]
[null,null,null,null,null,null,"",{"$f":"IF('Part 3 REACh'!B51=\"\",\"\",'Part 3 REACh'!B51)","v":""},null,""]
[null,null,null,null,null,null,"",{"$f":"IF('Part 3 REACh'!B52=\"\",\"\",'Part 3 REACh'!B52)","v":""},null,""]
[null,null,null,null,null,null,"",{"$f":"IF('Part 3 REACh'!B53=\"\",\"\",'Part 3 REACh'!B53)","v":""},null,""]
[null,null,null,null,null,null,"",{"$f":"IF('Part 3 REACh'!B54=\"\",\"\",'Part 3 REACh'!B54)","v":""},null,""]
[null,null,null,null,null,null,"",{"$f":"IF('Part 3 REACh'!B55=\"\",\"\",'Part 3 REACh'!B55)","v":""},null,""]
{"$rows_left_out":20}